Reaction Details
TargetVesicular acetylcholine transporter
LigandBDBM50292909
Substrate/Competitorn/a
Meas. Tech.ChEMBL_973123 (CHEMBL2412886)
Ki 4.3±n/a nM
Citation Li, JZhang, XZhang, ZPadakanti, PKJin, HCui, JLi, AZeng, DRath, NPFlores, HPerlmutter, JSParsons, SMTu, Z Heteroaromatic and aniline derivatives of piperidines as potent ligands for vesicular acetylcholine transporter. J Med Chem56:6216-33 (2013) 
 
Vesicular acetylcholine transporter
Name:Vesicular acetylcholine transporter
Type:PROTEIN
Mol. Mass.:56900.67
Organism:Homo sapiens (Human)
Description:ChEMBL_1507628
Residue:532
BDBM50292909
NameBDBM50292909
Synonyms:(+/-)-trans-2-Hydroxy-3-(4-benzoylpiperidino)tetralin Hydrochloride CHEMBL473546
TypeSmall organic molecule
Emp. Form.C22H25NO2
Mol. Mass.335.4394
SMILESO[C@@H]1Cc2ccccc2C[C@H]1N1CCC(CC1)C(=O)c1ccccc1