Reaction Details
TargetNuclear receptor corepressor 1
LigandBDBM50437825
Substrate/Competitorn/a
Meas. Tech.ChEMBL_973950 (CHEMBL2410097)
IC50 70±n/a nM
Citation Marson, CMMatthews, CJYiannaki, EAtkinson, SJSoden, PEShukla, LLamadema, NThomas, NS Discovery of potent, isoform-selective inhibitors of histone deacetylase containing chiral heterocyclic capping groups and a N-(2-aminophenyl)benzamide binding unit. J Med Chem56:6156-74 (2013) 
 
Nuclear receptor corepressor 1
Name:Nuclear receptor corepressor 1
Type:PROTEIN
Mol. Mass.:270226.27
Organism:Homo sapiens (Human)
Description:ChEMBL_107910
Residue:2440
BDBM50437825
NameBDBM50437825
Synonyms:CHEMBL2407732
TypeSmall organic molecule
Emp. Form.C28H26N6O3
Mol. Mass.494.5444
SMILESCC(=O)n1c(NCc2ccc(cc2)C(=O)Nc2ccccc2N)nc(O)c1Cc1c[nH]c2ccccc12