Reaction Details
TargetNuclear receptor corepressor 1
LigandBDBM50437832
Substrate/Competitorn/a
Meas. Tech.ChEMBL_973950 (CHEMBL2410097)
IC50 719±n/a nM
Citation Marson, CMMatthews, CJYiannaki, EAtkinson, SJSoden, PEShukla, LLamadema, NThomas, NS Discovery of potent, isoform-selective inhibitors of histone deacetylase containing chiral heterocyclic capping groups and a N-(2-aminophenyl)benzamide binding unit. J Med Chem56:6156-74 (2013) 
 
Nuclear receptor corepressor 1
Name:Nuclear receptor corepressor 1
Type:PROTEIN
Mol. Mass.:270226.27
Organism:Homo sapiens (Human)
Description:ChEMBL_107910
Residue:2440
BDBM50437832
NameBDBM50437832
Synonyms:CHEMBL2407743
TypeSmall organic molecule
Emp. Form.C23H20N6O2
Mol. Mass.412.4439
SMILESNc1cc(O)ccc1NC(=O)c1ccc(CNc2nccc(n2)-c2cccnc2)cc1