Reaction Details
TargetRibonuclease pancreatic
LigandBDBM50438454
Substrate/Competitorn/a
Meas. Tech.ChEMBL_975987 (CHEMBL2415636)
Ki 93000±n/a nM
Citation Datta, DSamanta, ADasgupta, SPathak, T 3'-Oxo-, amino-, thio- and sulfone-acetic acid modified thymidines: effect of increased acidity on ribonuclease A inhibition. Bioorg Med Chem21:4634-45 (2013) 
 
Ribonuclease pancreatic
Name:Ribonuclease pancreatic
Type:Enzyme
Mol. Mass.:16468.79
Organism:Bison bison (American bison)
Description:carboxamidomethylated RNase A
Residue:150
BDBM50438454
NameBDBM50438454
Synonyms:CHEMBL2414523
TypeSmall organic molecule
Emp. Form.C14H18N2O7S2
Mol. Mass.390.432
SMILESCc1cn([C@H]2C[C@H](SCC(O)=O)[C@@H](CSCC(O)=O)O2)c(=O)[nH]c1=O