Reaction Details
TargetHistamine H2 receptor
LigandBDBM86757
Substrate/Competitorn/a
Meas. Tech.ChEMBL_977139 (CHEMBL2416697)
Ki 2126±n/a nM
Citation Majo, VJMilak, MSPrabhakaran, JMali, PSavenkova, LSimpson, NRMann, JJParsey, RVKumar, JS Synthesis and in vivo evaluation of [(18)F]2-(4-(4-(2-(2-fluoroethoxy)phenyl)piperazin-1-yl)butyl)-4-methyl-1,2,4-triazine-3,5(2H,4H)-dione ([(18)F]FECUMI-101) as an imaging probe for 5-HT1A receptor agonist in nonhuman primates. Bioorg Med Chem21:5598-604 (2013) 
 
Histamine H2 receptor
Name:Histamine H2 receptor
Type:G Protein-Coupled Receptor (GPCR)
Mol. Mass.:40115.31
Organism:Homo sapiens (Human)
Description:n/a
Residue:359
BDBM86757
NameBDBM86757
Synonyms:CAS_0 [11C]MMP
TypeSmall organic molecule
Emp. Form.C19H27N5O3
Mol. Mass.373.4494
SMILESCOc1ccccc1N1CCN(CCCCn2ncc(=O)n(C)c2=O)CC1