Reaction Details
TargetPoly [ADP-ribose] polymerase 2
LigandBDBM50438601
Substrate/Competitorn/a
Meas. Tech.ChEMBL_975899 (CHEMBL2415548)
IC50 160±n/a nM
Citation Woon, ECSunderland, PTPaine, HALloyd, MDThompson, ASThreadgill, MD One-pot tandem Hurtley-retro-Claisen-cyclisation reactions in the synthesis of 3-substituted analogues of 5-aminoisoquinolin-1-one (5-AIQ), a water-soluble inhibitor of PARPs. Bioorg Med Chem21:5218-27 (2013) 
 
Poly [ADP-ribose] polymerase 2
Name:Poly [ADP-ribose] polymerase 2
Type:n/a
Mol. Mass.:63409.97
Organism:Mus musculus (Mouse)
Description:Alexis Biochemicals, Cat. no. ALX-201-064-C020
Residue:559
BDBM50438601
NameBDBM50438601
Synonyms:CHEMBL2414046
TypeSmall organic molecule
Emp. Form.C15H11ClN2O
Mol. Mass.270.714
SMILESNc1cccc2c1cc([nH]c2=O)-c1ccc(Cl)cc1