Reaction Details
TargetPoly [ADP-ribose] polymerase 2
LigandBDBM50438603
Substrate/Competitorn/a
Meas. Tech.ChEMBL_975899 (CHEMBL2415548)
IC50 120±n/a nM
Citation Woon, ECSunderland, PTPaine, HALloyd, MDThompson, ASThreadgill, MD One-pot tandem Hurtley-retro-Claisen-cyclisation reactions in the synthesis of 3-substituted analogues of 5-aminoisoquinolin-1-one (5-AIQ), a water-soluble inhibitor of PARPs. Bioorg Med Chem21:5218-27 (2013) 
 
Poly [ADP-ribose] polymerase 2
Name:Poly [ADP-ribose] polymerase 2
Type:n/a
Mol. Mass.:63409.97
Organism:Mus musculus (Mouse)
Description:Alexis Biochemicals, Cat. no. ALX-201-064-C020
Residue:559
BDBM50438603
NameBDBM50438603
Synonyms:CHEMBL2414044
TypeSmall organic molecule
Emp. Form.C16H14N2O
Mol. Mass.250.2952
SMILESCc1ccc(cc1)-c1cc2c(N)cccc2c(=O)[nH]1