Reaction Details
TargetFatty-acid amide hydrolase 1
LigandBDBM50438779
Substrate/Competitorn/a
Meas. Tech.ChEMBL_976855 (CHEMBL2416379)
IC50 41800±n/a nM
Citation Wu, HKelley, CJPino-Figueroa, AVu, HDMaher, TJ Macamides and their synthetic analogs: evaluation of in vitro FAAH inhibition. Bioorg Med Chem21:5188-97 (2013) 
 
Fatty-acid amide hydrolase 1
Name:Fatty-acid amide hydrolase 1
Type:Protein
Mol. Mass.:63071.19
Organism:Homo sapiens (Human)
Description:O00519
Residue:579
BDBM50438779
NameBDBM50438779
Synonyms:CHEMBL2413161
TypeSmall organic molecule
Emp. Form.C25H37NO
Mol. Mass.367.5674
SMILESCC\C=C/C\C=C/C\C=C/CCCCCCCC(=O)NCc1ccccc1