Reaction Details
TargetTyrosine-protein kinase JAK2
LigandBDBM50439012
Substrate/Competitorn/a
Meas. Tech.ChEMBL_979760 (CHEMBL2421805)
Ki 70±n/a nM
Citation Liang, JTsui, VVan Abbema, ABao, LBarrett, KBeresini, MBerezhkovskiy, LBlair, WSChang, CDriscoll, JEigenbrot, CGhilardi, NGibbons, PHalladay, JJohnson, AKohli, PBLai, YLiimatta, MMantik, PMenghrajani, KMurray, JSambrone, AXiao, YShia, SShin, YSmith, JSohn, SStanley, MUltsch, MZhang, BWu, LCMagnuson, S Lead identification of novel and selective TYK2 inhibitors. Eur J Med Chem67:175-87 (2013) 
 
Tyrosine-protein kinase JAK2
Name:Tyrosine-protein kinase JAK2
Type:Protein
Mol. Mass.:130684.68
Organism:Homo sapiens (Human)
Description:O60674
Residue:1132
BDBM50439012
NameBDBM50439012
Synonyms:CHEMBL2420812
TypeSmall organic molecule
Emp. Form.C15H14Cl2N4O2
Mol. Mass.353.203
SMILESCCNC(=O)Nc1cc(NC(=O)c2c(Cl)cccc2Cl)ccn1