Reaction Details
TargetO-acetylserine sulfhydrylase
LigandBDBM50439138
Substrate/Competitorn/a
Meas. Tech.ChEMBL_978241 (CHEMBL2423610)
IC50 103±n/a nM
Citation Poyraz, OJeankumar, VUSaxena, SSchnell, RHaraldsson, MYogeeswari, PSriram, DSchneider, G Structure-guided design of novel thiazolidine inhibitors of O-acetyl serine sulfhydrylase from Mycobacterium tuberculosis. J Med Chem56:6457-66 (2013) 
 
O-acetylserine sulfhydrylase
Name:O-acetylserine sulfhydrylase
Type:PROTEIN
Mol. Mass.:32747.29
Organism:Mycobacterium tuberculosis
Description:ChEMBL_978239
Residue:310
BDBM50439138
NameBDBM50439138
Synonyms:CHEMBL2418558
TypeSmall organic molecule
Emp. Form.C20H16N2O6S
Mol. Mass.412.416
SMILESCN1C(=O)\C(S\C1=N/c1cccc(c1)C(O)=O)=C\c1ccccc1OCC(O)=O