Reaction Details
TargetO-acetylserine sulfhydrylase
LigandBDBM50439139
Substrate/Competitorn/a
Meas. Tech.ChEMBL_978239 (CHEMBL2423608)
IC50 70±n/a nM
Citation Poyraz, OJeankumar, VUSaxena, SSchnell, RHaraldsson, MYogeeswari, PSriram, DSchneider, G Structure-guided design of novel thiazolidine inhibitors of O-acetyl serine sulfhydrylase from Mycobacterium tuberculosis. J Med Chem56:6457-66 (2013) 
 
O-acetylserine sulfhydrylase
Name:O-acetylserine sulfhydrylase
Type:PROTEIN
Mol. Mass.:32747.29
Organism:Mycobacterium tuberculosis
Description:ChEMBL_978239
Residue:310
BDBM50439139
NameBDBM50439139
Synonyms:CHEMBL2418489
TypeSmall organic molecule
Emp. Form.C21H20N2O6S
Mol. Mass.428.458
SMILESCOc1cc(\C=C2/S\C(=N/c3cccc(c3)C(O)=O)N(C)C2=O)cc(OC)c1OC