Reaction Details
TargetO-acetylserine sulfhydrylase
LigandBDBM50439147
Substrate/Competitorn/a
Meas. Tech.ChEMBL_978239 (CHEMBL2423608)
IC50 34±n/a nM
Citation Poyraz, OJeankumar, VUSaxena, SSchnell, RHaraldsson, MYogeeswari, PSriram, DSchneider, G Structure-guided design of novel thiazolidine inhibitors of O-acetyl serine sulfhydrylase from Mycobacterium tuberculosis. J Med Chem56:6457-66 (2013) 
 
O-acetylserine sulfhydrylase
Name:O-acetylserine sulfhydrylase
Type:PROTEIN
Mol. Mass.:32747.29
Organism:Mycobacterium tuberculosis
Description:ChEMBL_978239
Residue:310
BDBM50439147
NameBDBM50439147
Synonyms:CHEMBL2418524
TypeSmall organic molecule
Emp. Form.C19H16N2O4S
Mol. Mass.368.406
SMILESCOc1ccc(\C=C2/S\C(=N/c3cccc(c3)C(O)=O)N(C)C2=O)cc1