Reaction Details
TargetTyrosine-protein kinase ABL1
LigandBDBM50439333
Substrate/Competitorn/a
Meas. Tech.ChEMBL_978658 (CHEMBL2422321)
IC50 56±n/a nM
Citation Conconi, MTMarzaro, GUrbani, LZanusso, IDi Liddo, RCastagliuolo, IBrun, PTonus, FFerrarese, AGuiotto, AChilin, A Quinazoline-based multi-tyrosine kinase inhibitors: synthesis, modeling, antitumor and antiangiogenic properties. Eur J Med Chem67:373-83 (2013) 
 
Tyrosine-protein kinase ABL1
Name:Tyrosine-protein kinase ABL1
Type:Enzyme
Mol. Mass.:122897.30
Organism:Homo sapiens (Human)
Description:P00519
Residue:1130
BDBM50439333
NameBDBM50439333
Synonyms:CHEMBL2419762
TypeSmall organic molecule
Emp. Form.C23H19N3O2
Mol. Mass.369.4159
SMILESC1COc2cc3ncnc(Nc4cccc(c4)-c4ccccc4)c3cc2OC1