Reaction Details
TargetG protein-activated inward rectifier potassium channel 1
LigandBDBM50115223
Substrate/Competitorn/a
Meas. Tech.ChEMBL_980168 (CHEMBL2424002)
EC50 1400±n/a nM
Citation Ramos-Hunter, SJEngers, DWKaufmann, KDu, YLindsley, CWWeaver, CDSulikowski, GA Discovery and SAR of a novel series of GIRK1/2 and GIRK1/4 activators. Bioorg Med Chem Lett23:5195-8 (2013) 
 
G protein-activated inward rectifier potassium channel 1
Name:G protein-activated inward rectifier potassium channel 1
Type:PROTEIN
Mol. Mass.:56610.74
Organism:Homo sapiens (Human)
Description:ChEMBL_107915
Residue:501
BDBM50115223
NameBDBM50115223
Synonyms:1-(5-Methyl-2-phenyl-2H-pyrazol-3-yl)-3-phenyl-urea | CHEMBL86962
TypeSmall organic molecule
Emp. Form.C17H16N4O
Mol. Mass.292.3351
SMILESCc1cc(NC(=O)Nc2ccccc2)n(n1)-c1ccccc1