Reaction Details
TargetG protein-activated inward rectifier potassium channel 4
LigandBDBM50439405
Substrate/Competitorn/a
Meas. Tech.ChEMBL_980167 (CHEMBL2424001)
EC50 1600±n/a nM
Citation Ramos-Hunter, SJEngers, DWKaufmann, KDu, YLindsley, CWWeaver, CDSulikowski, GA Discovery and SAR of a novel series of GIRK1/2 and GIRK1/4 activators. Bioorg Med Chem Lett23:5195-8 (2013) 
 
G protein-activated inward rectifier potassium channel 4
Name:G protein-activated inward rectifier potassium channel 4
Type:PROTEIN
Mol. Mass.:47658.06
Organism:Homo sapiens (Human)
Description:ChEMBL_107914
Residue:419
BDBM50439405
NameBDBM50439405
Synonyms:CHEMBL2420538
TypeSmall organic molecule
Emp. Form.C16H17ClN2O3S
Mol. Mass.352.836
SMILESCN(C)S(=O)(=O)c1cccc(NC(=O)Cc2ccccc2Cl)c1