Reaction Details
TargetG protein-activated inward rectifier potassium channel 4
LigandBDBM50439408
Substrate/Competitorn/a
Meas. Tech.ChEMBL_980171 (CHEMBL2424209)
EC50 1800±n/a nM
Citation Ramos-Hunter, SJEngers, DWKaufmann, KDu, YLindsley, CWWeaver, CDSulikowski, GA Discovery and SAR of a novel series of GIRK1/2 and GIRK1/4 activators. Bioorg Med Chem Lett23:5195-8 (2013) 
 
G protein-activated inward rectifier potassium channel 4
Name:G protein-activated inward rectifier potassium channel 4
Type:PROTEIN
Mol. Mass.:47658.06
Organism:Homo sapiens (Human)
Description:ChEMBL_107914
Residue:419
BDBM50439408
NameBDBM50439408
Synonyms:CHEMBL2420534
TypeSmall organic molecule
Emp. Form.C14H11Cl2NO
Mol. Mass.280.149
SMILESClc1cccc(NC(=O)Cc2ccccc2Cl)c1