Reaction Details
TargetG protein-activated inward rectifier potassium channel 4
LigandBDBM50439412
Substrate/Competitorn/a
Meas. Tech.ChEMBL_980171 (CHEMBL2424209)
EC50 7800±n/a nM
Citation Ramos-Hunter, SJEngers, DWKaufmann, KDu, YLindsley, CWWeaver, CDSulikowski, GA Discovery and SAR of a novel series of GIRK1/2 and GIRK1/4 activators. Bioorg Med Chem Lett23:5195-8 (2013) 
 
G protein-activated inward rectifier potassium channel 4
Name:G protein-activated inward rectifier potassium channel 4
Type:PROTEIN
Mol. Mass.:47658.06
Organism:Homo sapiens (Human)
Description:ChEMBL_107914
Residue:419
BDBM50439412
NameBDBM50439412
Synonyms:CHEMBL2420530
TypeSmall organic molecule
Emp. Form.C15H12ClF2NO2
Mol. Mass.311.711
SMILESFC(F)Oc1cccc(NC(=O)Cc2ccccc2Cl)c1