Reaction Details
TargetG protein-activated inward rectifier potassium channel 4
LigandBDBM50439414
Substrate/Competitorn/a
Meas. Tech.ChEMBL_980171 (CHEMBL2424209)
EC50>10000±n/a nM
Citation Ramos-Hunter, SJEngers, DWKaufmann, KDu, YLindsley, CWWeaver, CDSulikowski, GA Discovery and SAR of a novel series of GIRK1/2 and GIRK1/4 activators. Bioorg Med Chem Lett23:5195-8 (2013) 
 
G protein-activated inward rectifier potassium channel 4
Name:G protein-activated inward rectifier potassium channel 4
Type:PROTEIN
Mol. Mass.:47658.06
Organism:Homo sapiens (Human)
Description:ChEMBL_107914
Residue:419
BDBM50439414
NameBDBM50439414
Synonyms:CHEMBL2420550
TypeSmall organic molecule
Emp. Form.C15H13ClFNO3S
Mol. Mass.341.785
SMILESCS(=O)(=O)c1cc(NC(=O)Cc2ccccc2Cl)ccc1F