Reaction Details
TargetG protein-activated inward rectifier potassium channel 1
LigandBDBM50439411
Substrate/Competitorn/a
Meas. Tech.ChEMBL_980173 (CHEMBL2424211)
EC50>10000±n/a nM
Citation Ramos-Hunter, SJEngers, DWKaufmann, KDu, YLindsley, CWWeaver, CDSulikowski, GA Discovery and SAR of a novel series of GIRK1/2 and GIRK1/4 activators. Bioorg Med Chem Lett23:5195-8 (2013) 
 
G protein-activated inward rectifier potassium channel 1
Name:G protein-activated inward rectifier potassium channel 1
Type:PROTEIN
Mol. Mass.:56610.74
Organism:Homo sapiens (Human)
Description:ChEMBL_107915
Residue:501
BDBM50439411
NameBDBM50439411
Synonyms:CHEMBL2420531
TypeSmall organic molecule
Emp. Form.C15H10Cl2F3NO
Mol. Mass.348.147
SMILESFC(F)(F)c1cc(Cl)cc(NC(=O)Cc2ccccc2Cl)c1