Reaction Details
TargetCyclin-dependent kinase 5
LigandBDBM6866
Substrate/Competitorn/a
Meas. Tech.ChEMBL_979933 (CHEMBL2422666)
IC50 13±n/a nM
Citation Gao, CCahya, SNicolaou, CAWang, JWatson, IACummins, DJIversen, PWVieth, M Selectivity data: assessment, predictions, concordance, and implications. J Med Chem56:6991-7002 (2013) 
 
Cyclin-dependent kinase 5
Name:Cyclin-dependent kinase 5
Type:Enzyme Subunit
Mol. Mass.:33308.61
Organism:Homo sapiens (Human)
Description:n/a
Residue:292
BDBM6866
NameBDBM6866
Synonyms:1-Acyl-1H-[1,2,4]triazole-3,5-diamine Analogue 3b 4-[[5-Amino-1-(2,6-difluorobenzoyl)-1H-1,2,4-triazol-3-yl]amino]-benzenesulfonamide JNJ-7706621 | cid_5330790
TypeSmall organic molecule
Emp. Form.C15H12F2N6O3S
Mol. Mass.394.356
SMILESNc1nc(Nc2ccc(cc2)S(N)(=O)=O)nn1C(=O)c1c(F)cccc1F