Reaction Details
TargetReceptor-type tyrosine-protein kinase FLT3
LigandBDBM50277583
Substrate/Competitorn/a
Meas. Tech.ChEMBL_979936 (CHEMBL2422669)
IC50 25±n/a nM
Citation Gao, CCahya, SNicolaou, CAWang, JWatson, IACummins, DJIversen, PWVieth, M Selectivity data: assessment, predictions, concordance, and implications. J Med Chem56:6991-7002 (2013) 
 
Receptor-type tyrosine-protein kinase FLT3
Name:Receptor-type tyrosine-protein kinase FLT3
Type:Enzyme
Mol. Mass.:112888.62
Organism:Homo sapiens (Human)
Description:P36888
Residue:993
BDBM50277583
NameBDBM50277583
Synonyms:2-amino-4-methyl-1,3-thiazol-5-yl)-N-[4-(morpholin-4-yl)phenyl]pyrimidin-2-amine, 5 Aminopyrimidine, 9 CYC-116
TypeSmall organic molecule
Emp. Form.C18H20N6OS
Mol. Mass.368.456
SMILESCc1nc(N)sc1-c1ccnc(Nc2ccc(cc2)N2CCOCC2)n1