Reaction Details
TargetSerine/threonine-protein kinase pim-1
LigandBDBM33971
Substrate/Competitorn/a
Meas. Tech.ChEMBL_979924 (CHEMBL2422657)
IC50 50±n/a nM
Citation Gao, CCahya, SNicolaou, CAWang, JWatson, IACummins, DJIversen, PWVieth, M Selectivity data: assessment, predictions, concordance, and implications. J Med Chem56:6991-7002 (2013) 
 
Serine/threonine-protein kinase pim-1
Name:Serine/threonine-protein kinase pim-1
Type:Protein
Mol. Mass.:35681.82
Organism:Homo sapiens (Human)
Description:P11309
Residue:313
BDBM33971
NameBDBM33971
Synonyms:AEB071 med.21724, Compound 190
TypeSmall organic molecule
Emp. Form.C25H22N6O2
Mol. Mass.438.4812
SMILESCN1CCN(CC1)c1nc(C2=C(C(=O)NC2=O)c2c[nH]c3ccccc23)c2ccccc2n1