Reaction Details
TargetFocal adhesion kinase 1
LigandBDBM50318884
Substrate/Competitorn/a
Meas. Tech.ChEMBL_979929 (CHEMBL2422662)
IC50 1.000000±n/a nM
Citation Gao, CCahya, SNicolaou, CAWang, JWatson, IACummins, DJIversen, PWVieth, M Selectivity data: assessment, predictions, concordance, and implications. J Med Chem56:6991-7002 (2013) 
 
Focal adhesion kinase 1
Name:Focal adhesion kinase 1
Type:Tyrosine-protein kinase
Mol. Mass.:119233.17
Organism:Homo sapiens (Human)
Description:Q05397
Residue:1052
BDBM50318884
NameBDBM50318884
Synonyms:CHEMBL1084546 N-methyl-N-(3-((2-(2-oxoindolin-5-ylamino)-5-(trifluoromethyl)pyrimidin-4-ylamino)methyl)pyridin-2-yl)methanesulfonamide PF-562271
TypeSmall organic molecule
Emp. Form.C21H20F3N7O3S
Mol. Mass.507.489
SMILESCN(c1ncccc1CNc1nc(Nc2ccc3NC(=O)Cc3c2)ncc1C(F)(F)F)S(C)(=O)=O