Reaction Details
TargetOrexin/Hypocretin receptor type 1
LigandBDBM50438822
Substrate/Competitorn/a
Meas. Tech.ChEMBL_980238 (CHEMBL2421153)
IC50 6.0±n/a nM
Citation Perrey, DAGerman, NAGilmour, BPLi, JXHarris, DLThomas, BFZhang, Y Substituted tetrahydroisoquinolines as selective antagonists for the orexin 1 receptor. J Med Chem56:6901-16 (2013) 
 
Orexin/Hypocretin receptor type 1
Name:Orexin/Hypocretin receptor type 1
Type:Protein
Mol. Mass.:47554.50
Organism:Homo sapiens (Human)
Description:O43613
Residue:425
BDBM50438822
NameBDBM50438822
Synonyms:CHEMBL2413367
TypeSmall organic molecule
Emp. Form.C31H38N2O5
Mol. Mass.518.6438
SMILESCOc1ccc(C[C@@H]2N(CCc3cc(OC)c(OC)cc23)[C@@H](C(=O)NC(C)C)c2ccccc2)cc1OC