Reaction Details
TargetHistone deacetylase 3
LigandBDBM50015144
Substrate/Competitorn/a
Meas. Tech.ChEMBL_977747 (CHEMBL2424294)
Kd 341000±n/a nM
Citation Kalin, JHBergman, JA Development and therapeutic implications of selective histone deacetylase 6 inhibitors. J Med Chem56:6297-313 (2013) 
 
Histone deacetylase 3
Name:Histone deacetylase 3
Type:Enzyme
Mol. Mass.:48829.55
Organism:Homo sapiens (Human)
Description:O15379
Residue:428
BDBM50015144
NameBDBM50015144
Synonyms:2-(4-Butoxy-phenyl)-N-hydroxy-acetamide CHEMBL94394 | cid_2466
TypeSmall organic molecule
Emp. Form.C12H17NO3
Mol. Mass.223.2683
SMILESCCCCOc1ccc(CC(=O)NO)cc1