Reaction Details
TargetHistone deacetylase 3
LigandBDBM50439672
Substrate/Competitorn/a
Meas. Tech.ChEMBL_977747 (CHEMBL2424294)
IC50 14000±n/a nM
Citation Kalin, JHBergman, JA Development and therapeutic implications of selective histone deacetylase 6 inhibitors. J Med Chem56:6297-313 (2013) 
 
Histone deacetylase 3
Name:Histone deacetylase 3
Type:Enzyme
Mol. Mass.:48829.55
Organism:Homo sapiens (Human)
Description:O15379
Residue:428
BDBM50439672
NameBDBM50439672
Synonyms:CHEMBL2417783
TypeSmall organic molecule
Emp. Form.C18H23N3O3S
Mol. Mass.361.459
SMILESCc1onc(c1C(=O)NCCCCCNC(=O)CS)-c1ccccc1