Reaction Details
TargetMultidrug resistance-associated protein 1
LigandBDBM50022815
Substrate/Competitorn/a
Meas. Tech.ChEMBL_978191 (CHEMBL2423199)
IC50 2810±n/a nM
Citation Juvale, KStefan, KWiese, M Synthesis and biological evaluation of flavones and benzoflavones as inhibitors of BCRP/ABCG2. Eur J Med Chem67:115-26 (2013) 
 
Multidrug resistance-associated protein 1
Name:Multidrug resistance-associated protein 1
Type:n/a
Mol. Mass.:171597.72
Organism:Homo sapiens (Human)
Description:P33527
Residue:1531
BDBM50022815
NameBDBM50022815
Synonyms:(3S,6S,9S,12R,15S,18S,21S,24S,30S,33S)-30-ethyl-33-[(1R,2R,4E)-1-hydroxy-2-methylhex-4-en-1-yl]-1,4,7,10,12,15,19,25,28-nonamethyl-6,9,18,24-tetrakis(2-methylpropyl)-3,21-bis(propan-2-yl)-1,4,7,10,13,16,19,22,25,28,31-undecaazacyclotritriacontan-2,5,8,11,14,17,20,23,26,29,32-undecone 30-Ethyl-33-(1-hydroxy-2-methyl-hex-4-enyl)-6,9,18,24-tetraisobutyl-3,21-diisopropyl-1,4,7,10,12,15,19,25,28-nonamethyl-1,4,7,10,13,16,19,22,25,28,31undecaaza-cyclotritriacontan-2,5,8,11,14,17,20,23,26,29,32-undecaone Cyclosporin A Cyclosproine A US9138393, Cyclosporin A
TypeSmall organic molecule
Emp. Form.C62H111N11O12
Mol. Mass.1202.6112
SMILESCC[C@@H]1NC(=O)[C@H]([C@H](O)[C@H](C)C\C=C\C)N(C)C(=O)[C@H](C(C)C)N(C)C(=O)[C@H](CC(C)C)N(C)C(=O)[C@H](CC(C)C)N(C)C(=O)[C@@H](C)NC(=O)[C@H](C)NC(=O)[C@H](CC(C)C)N(C)C(=O)[C@@H](NC(=O)[C@H](CC(C)C)N(C)C(=O)CN(C)C1=O)C(C)C