Reaction Details
TargetType-1 angiotensin II receptor
LigandBDBM50035454
Substrate/Competitorn/a
Meas. Tech.ChEMBL_982135 (CHEMBL2428850)
IC50 0.080000±n/a nM
Citation  TBA Med Chem Res0:1-17 (2013)    Article
 
Type-1 angiotensin II receptor
Name:Type-1 angiotensin II receptor
Type:Enzyme Catalytic Domain
Mol. Mass.:41009.15
Organism:RABBIT
Description:ANGIOTENSIN AT1 AGTR1 RABBIT::P34976
Residue:359
BDBM50035454
NameBDBM50035454
Synonyms:CHEMBL343309 | Cyclopropanecarboxylic acid (3-{3-butyl-4-[2'-(2-chloro-benzoylsulfamoyl)-biphenyl-4-ylmethyl]-5-oxo-4,5-dihydro-[1,2,4]triazol-1-yl}-4-chloro-phenyl)-amide
TypeSmall organic molecule
Emp. Form.C36H33Cl2N5O5S
Mol. Mass.718.649
SMILESCCCCc1nn(-c2cc(NC(=O)C3CC3)ccc2Cl)c(=O)n1Cc1ccc(cc1)-c1ccccc1S(=O)(=O)NC(=O)c1ccccc1Cl