Reaction Details
TargetType-1 angiotensin II receptor
LigandBDBM50035434
Substrate/Competitorn/a
Meas. Tech.ChEMBL_982135 (CHEMBL2428850)
IC50 0.052000±n/a nM
Citation  TBA Med Chem Res0:1-17 (2013)    Article
 
Type-1 angiotensin II receptor
Name:Type-1 angiotensin II receptor
Type:Enzyme Catalytic Domain
Mol. Mass.:41009.15
Organism:RABBIT
Description:ANGIOTENSIN AT1 AGTR1 RABBIT::P34976
Residue:359
BDBM50035434
NameBDBM50035434
Synonyms:CHEMBL265797 | N-(3-{3-Butyl-4-[2'-(2-chloro-benzoylsulfamoyl)-biphenyl-4-ylmethyl]-5-oxo-4,5-dihydro-[1,2,4]triazol-1-yl}-4-chloro-phenyl)-acetamide
TypeSmall organic molecule
Emp. Form.C34H31Cl2N5O5S
Mol. Mass.692.611
SMILESCCCCc1nn(-c2cc(NC(C)=O)ccc2Cl)c(=O)n1Cc1ccc(cc1)-c1ccccc1S(=O)(=O)NC(=O)c1ccccc1Cl