Reaction Details
TargetType-1 angiotensin II receptor
LigandBDBM50035445
Substrate/Competitorn/a
Meas. Tech.ChEMBL_982135 (CHEMBL2428850)
IC50 0.110000±n/a nM
Citation  TBA Med Chem Res0:1-17 (2013)    Article
 
Type-1 angiotensin II receptor
Name:Type-1 angiotensin II receptor
Type:Enzyme Catalytic Domain
Mol. Mass.:41009.15
Organism:RABBIT
Description:ANGIOTENSIN AT1 AGTR1 RABBIT::P34976
Residue:359
BDBM50035445
NameBDBM50035445
Synonyms:4'-[3-Butyl-5-oxo-1-(2-trifluoromethyl-phenyl)-1,5-dihydro-[1,2,4]triazol-4-ylmethyl]-biphenyl-2-sulfonic acid 2-chloro-benzoylamide | CHEMBL316300
TypeSmall organic molecule
Emp. Form.C33H28ClF3N4O4S
Mol. Mass.669.113
SMILESCCCCc1nn(-c2ccccc2C(F)(F)F)c(=O)n1Cc1ccc(cc1)-c1ccccc1S(=O)(=O)NC(=O)c1ccccc1Cl