Reaction Details
TargetG-protein coupled receptor 35
LigandBDBM85507
Substrate/Competitorn/a
Meas. Tech.ChEMBL_983070 (CHEMBL2427430)
EC50 1110±n/a nM
Citation Thimm, DFunke, MMeyer, AMüller, CE 6-Bromo-8-(4-[(3)H]methoxybenzamido)-4-oxo-4H-chromene-2-carboxylic Acid: a powerful tool for studying orphan G protein-coupled receptor GPR35. J Med Chem56:7084-99 (2013) 
 
G-protein coupled receptor 35
Name:G-protein coupled receptor 35
Type:Enzyme Catalytic Domain
Mol. Mass.:34085.57
Organism:Homo sapiens (Human)
Description:gi_33695097
Residue:309
BDBM85507
NameBDBM85507
Synonyms:CAS_4394-00-7 Niflumic acid US10278929, Niflumic acid US20240002326, Compound Niflumic acid
TypeSmall organic molecule
Emp. Form.C13H9F3N2O2
Mol. Mass.282.218
SMILESOC(=O)c1cccnc1Nc1cccc(c1)C(F)(F)F