Reaction Details
TargetG-protein coupled receptor 35
LigandBDBM50436009
Substrate/Competitorn/a
Meas. Tech.ChEMBL_982932 (CHEMBL2429572)
EC50 346±n/a nM
Citation Thimm, DFunke, MMeyer, AMüller, CE 6-Bromo-8-(4-[(3)H]methoxybenzamido)-4-oxo-4H-chromene-2-carboxylic Acid: a powerful tool for studying orphan G protein-coupled receptor GPR35. J Med Chem56:7084-99 (2013) 
 
G-protein coupled receptor 35
Name:G-protein coupled receptor 35
Type:Enzyme Catalytic Domain
Mol. Mass.:34085.57
Organism:Homo sapiens (Human)
Description:gi_33695097
Residue:309
BDBM50436009
NameBDBM50436009
Synonyms:CHEMBL2392157
TypeSmall organic molecule
Emp. Form.C18H13NO6
Mol. Mass.339.2989
SMILESCOc1ccc(cc1)C(=O)Nc1cccc2c1oc(cc2=O)C(O)=O