Reaction Details
TargetG-protein coupled receptor 35
LigandBDBM50436006
Substrate/Competitorn/a
Meas. Tech.ChEMBL_982932 (CHEMBL2429572)
EC50 16.4±n/a nM
Citation Thimm, DFunke, MMeyer, AMüller, CE 6-Bromo-8-(4-[(3)H]methoxybenzamido)-4-oxo-4H-chromene-2-carboxylic Acid: a powerful tool for studying orphan G protein-coupled receptor GPR35. J Med Chem56:7084-99 (2013) 
 
G-protein coupled receptor 35
Name:G-protein coupled receptor 35
Type:Enzyme Catalytic Domain
Mol. Mass.:34085.57
Organism:Homo sapiens (Human)
Description:gi_33695097
Residue:309
BDBM50436006
NameBDBM50436006
Synonyms:CHEMBL2392171
TypeSmall organic molecule
Emp. Form.C17H8BrCl2NO5
Mol. Mass.457.059
SMILESOC(=O)c1cc(=O)c2cc(Br)cc(NC(=O)c3ccc(Cl)cc3Cl)c2o1