Reaction Details
TargetG-protein coupled receptor 35
LigandBDBM50440034
Substrate/Competitorn/a
Meas. Tech.ChEMBL_982932 (CHEMBL2429572)
EC50 349±n/a nM
Citation Thimm, DFunke, MMeyer, AMüller, CE 6-Bromo-8-(4-[(3)H]methoxybenzamido)-4-oxo-4H-chromene-2-carboxylic Acid: a powerful tool for studying orphan G protein-coupled receptor GPR35. J Med Chem56:7084-99 (2013) 
 
G-protein coupled receptor 35
Name:G-protein coupled receptor 35
Type:Enzyme Catalytic Domain
Mol. Mass.:34085.57
Organism:Homo sapiens (Human)
Description:gi_33695097
Residue:309
BDBM50440034
NameBDBM50440034
Synonyms:CHEMBL2425825
TypeSmall organic molecule
Emp. Form.C12H9NO5S
Mol. Mass.279.269
SMILESOC(=O)COc1ccc(\C=C2/SC(=O)NC2=O)cc1