Reaction Details
TargetG-protein coupled receptor 35
LigandBDBM35525
Substrate/Competitorn/a
Meas. Tech.ChEMBL_982934 (CHEMBL2429574)
Ki 39±n/a nM
Citation Thimm, DFunke, MMeyer, AMüller, CE 6-Bromo-8-(4-[(3)H]methoxybenzamido)-4-oxo-4H-chromene-2-carboxylic Acid: a powerful tool for studying orphan G protein-coupled receptor GPR35. J Med Chem56:7084-99 (2013) 
 
G-protein coupled receptor 35
Name:G-protein coupled receptor 35
Type:Enzyme Catalytic Domain
Mol. Mass.:34085.57
Organism:Homo sapiens (Human)
Description:gi_33695097
Residue:309
BDBM35525
NameBDBM35525
Synonyms:3,3''''-methylenebis(4-hydroxy-coumarin 3,3''''-methylenebis[4-hydroxycoumarin Bishydroxycoumarin DICUMAROL symmetric dicoumarol analogue, 1
TypeSmall organic molecule
Emp. Form.C19H12O6
Mol. Mass.336.295
SMILESOc1c(Cc2c(O)c3ccccc3oc2=O)c(=O)oc2ccccc12