Reaction Details
TargetDeoxycytidine kinase
LigandBDBM50440152
Substrate/Competitorn/a
Meas. Tech.ChEMBL_981695 (CHEMBL2429677)
IC50 510±n/a nM
Citation Murphy, JMArmijo, ALNomme, JLee, CHSmith, QALi, ZCampbell, DOLiao, HINathanson, DAAustin, WRLee, JTDarvish, RWei, LWang, JSu, YDamoiseaux, RSadeghi, SPhelps, MEHerschman, HRCzernin, JAlexandrova, ANJung, MELavie, ARadu, CG Development of new deoxycytidine kinase inhibitors and noninvasive in vivo evaluation using positron emission tomography. J Med Chem56:6696-708 (2013) 
 
Deoxycytidine kinase
Name:Deoxycytidine kinase
Type:PROTEIN
Mol. Mass.:30361.42
Organism:Mus musculus
Description:ChEMBL_981695
Residue:260
BDBM50440152
NameBDBM50440152
Synonyms:CHEMBL2426557
TypeSmall organic molecule
Emp. Form.C16H16FN5S2
Mol. Mass.361.46
SMILESCCc1sc(nc1CSc1nc(N)cc(N)n1)-c1cccc(F)c1