Reaction Details
TargetDeoxycytidine kinase
LigandBDBM50440155
Substrate/Competitorn/a
Meas. Tech.ChEMBL_981695 (CHEMBL2429677)
IC50 30±n/a nM
Citation Murphy, JMArmijo, ALNomme, JLee, CHSmith, QALi, ZCampbell, DOLiao, HINathanson, DAAustin, WRLee, JTDarvish, RWei, LWang, JSu, YDamoiseaux, RSadeghi, SPhelps, MEHerschman, HRCzernin, JAlexandrova, ANJung, MELavie, ARadu, CG Development of new deoxycytidine kinase inhibitors and noninvasive in vivo evaluation using positron emission tomography. J Med Chem56:6696-708 (2013) 
 
Deoxycytidine kinase
Name:Deoxycytidine kinase
Type:PROTEIN
Mol. Mass.:30361.42
Organism:Mus musculus
Description:ChEMBL_981695
Residue:260
BDBM50440155
NameBDBM50440155
Synonyms:CHEMBL2426598
TypeSmall organic molecule
Emp. Form.C19H22FN5O2S2
Mol. Mass.435.539
SMILESCCc1sc(nc1CSc1nc(N)cc(N)n1)-c1ccc(OC)c(OCCF)c1