Reaction Details
TargetDeoxycytidine kinase
LigandBDBM50440143
Substrate/Competitorn/a
Meas. Tech.ChEMBL_981695 (CHEMBL2429677)
IC50 330±n/a nM
Citation Murphy, JMArmijo, ALNomme, JLee, CHSmith, QALi, ZCampbell, DOLiao, HINathanson, DAAustin, WRLee, JTDarvish, RWei, LWang, JSu, YDamoiseaux, RSadeghi, SPhelps, MEHerschman, HRCzernin, JAlexandrova, ANJung, MELavie, ARadu, CG Development of new deoxycytidine kinase inhibitors and noninvasive in vivo evaluation using positron emission tomography. J Med Chem56:6696-708 (2013) 
 
Deoxycytidine kinase
Name:Deoxycytidine kinase
Type:PROTEIN
Mol. Mass.:30361.42
Organism:Mus musculus
Description:ChEMBL_981695
Residue:260
BDBM50440143
NameBDBM50440143
Synonyms:CHEMBL2426585
TypeSmall organic molecule
Emp. Form.C18H20FN5O2S2
Mol. Mass.421.512
SMILESCOc1ccc(cc1OCCCF)-c1nc(CSc2nc(N)cc(N)n2)cs1