Reaction Details
TargetDeoxycytidine kinase
LigandBDBM50440150
Substrate/Competitorn/a
Meas. Tech.ChEMBL_981694 (CHEMBL2429676)
IC50 173±n/a nM
Citation Murphy, JMArmijo, ALNomme, JLee, CHSmith, QALi, ZCampbell, DOLiao, HINathanson, DAAustin, WRLee, JTDarvish, RWei, LWang, JSu, YDamoiseaux, RSadeghi, SPhelps, MEHerschman, HRCzernin, JAlexandrova, ANJung, MELavie, ARadu, CG Development of new deoxycytidine kinase inhibitors and noninvasive in vivo evaluation using positron emission tomography. J Med Chem56:6696-708 (2013) 
 
Deoxycytidine kinase
Name:Deoxycytidine kinase
Type:PROTEIN
Mol. Mass.:30510.65
Organism:Homo sapiens (Human)
Description:ChEMBL_1437135
Residue:260
BDBM50440150
NameBDBM50440150
Synonyms:CHEMBL2426559
TypeSmall organic molecule
Emp. Form.C17H17F2N5S2
Mol. Mass.393.477
SMILESCCCc1sc(nc1CSc1nc(N)cc(N)n1)-c1cc(F)cc(F)c1