Reaction Details
TargetDeoxycytidine kinase
LigandBDBM50440159
Substrate/Competitorn/a
Meas. Tech.ChEMBL_981694 (CHEMBL2429676)
IC50 512±n/a nM
Citation Murphy, JMArmijo, ALNomme, JLee, CHSmith, QALi, ZCampbell, DOLiao, HINathanson, DAAustin, WRLee, JTDarvish, RWei, LWang, JSu, YDamoiseaux, RSadeghi, SPhelps, MEHerschman, HRCzernin, JAlexandrova, ANJung, MELavie, ARadu, CG Development of new deoxycytidine kinase inhibitors and noninvasive in vivo evaluation using positron emission tomography. J Med Chem56:6696-708 (2013) 
 
Deoxycytidine kinase
Name:Deoxycytidine kinase
Type:PROTEIN
Mol. Mass.:30510.65
Organism:Homo sapiens (Human)
Description:ChEMBL_1437135
Residue:260
BDBM50440159
NameBDBM50440159
Synonyms:CHEMBL2426594
TypeSmall organic molecule
Emp. Form.C17H19FN6O2S2
Mol. Mass.422.5
SMILESCCOc1ccc(cc1OCCF)-c1nc(CSc2nc(N)nc(N)n2)cs1