Reaction Details
TargetGlucocorticoid receptor
LigandBDBM50440232
Substrate/Competitorn/a
Meas. Tech.ChEMBL_982006 (CHEMBL2428210)
EC50 81±n/a nM
Citation Sheppeck, JEGilmore, JLXiao, HYDhar, TGNirschl, DDoweyko, AMSack, JSCorbett, MJMalley, MFGougoutas, JZMckay, LCunningham, MDHabte, SFDodd, JHNadler, SGSomerville, JEBarrish, JC Discovery of potent and selective nonsteroidal indazolyl amide glucocorticoid receptor agonists. Bioorg Med Chem Lett23:5442-7 (2013) 
 
Glucocorticoid receptor
Name:Glucocorticoid receptor
Type:Enzyme
Mol. Mass.:85656.87
Organism:Homo sapiens (Human)
Description:P04150
Residue:777
BDBM50440232
NameBDBM50440232
Synonyms:CHEMBL2426637
TypeSmall organic molecule
Emp. Form.C23H24FN5OS
Mol. Mass.437.533
SMILESCC(C)C(c1ccc2n(ncc2c1)-c1ccc(F)cc1)C(C)(C)C(=O)Nc1nncs1