Reaction Details
TargetGlucocorticoid receptor
LigandBDBM50440226
Substrate/Competitorn/a
Meas. Tech.ChEMBL_982008 (CHEMBL2428212)
Ki 11±n/a nM
Citation Sheppeck, JEGilmore, JLXiao, HYDhar, TGNirschl, DDoweyko, AMSack, JSCorbett, MJMalley, MFGougoutas, JZMckay, LCunningham, MDHabte, SFDodd, JHNadler, SGSomerville, JEBarrish, JC Discovery of potent and selective nonsteroidal indazolyl amide glucocorticoid receptor agonists. Bioorg Med Chem Lett23:5442-7 (2013) 
 
Glucocorticoid receptor
Name:Glucocorticoid receptor
Type:Enzyme
Mol. Mass.:85656.87
Organism:Homo sapiens (Human)
Description:P04150
Residue:777
BDBM50440226
NameBDBM50440226
Synonyms:CHEMBL2426643
TypeSmall organic molecule
Emp. Form.C28H24FN3OS
Mol. Mass.469.573
SMILESCC(C)(C(c1ccccc1)c1ccc2n(ncc2c1)-c1ccc(F)cc1)C(=O)Nc1ccsc1