Reaction Details
TargetGlucocorticoid receptor
LigandBDBM50440219
Substrate/Competitorn/a
Meas. Tech.ChEMBL_982008 (CHEMBL2428212)
Ki 6.0±n/a nM
Citation Sheppeck, JEGilmore, JLXiao, HYDhar, TGNirschl, DDoweyko, AMSack, JSCorbett, MJMalley, MFGougoutas, JZMckay, LCunningham, MDHabte, SFDodd, JHNadler, SGSomerville, JEBarrish, JC Discovery of potent and selective nonsteroidal indazolyl amide glucocorticoid receptor agonists. Bioorg Med Chem Lett23:5442-7 (2013) 
 
Glucocorticoid receptor
Name:Glucocorticoid receptor
Type:Enzyme
Mol. Mass.:85656.87
Organism:Homo sapiens (Human)
Description:P04150
Residue:777
BDBM50440219
NameBDBM50440219
Synonyms:CHEMBL2426665
TypeSmall organic molecule
Emp. Form.C27H23FN4OS
Mol. Mass.470.561
SMILESCC(C)([C@@H](c1ccccc1)c1ccc2n(ncc2c1)-c1ccc(F)cc1)C(=O)Nc1nccs1