Reaction Details
TargetRibosyldihydronicotinamide dehydrogenase [quinone]
LigandBDBM50440266
Substrate/Competitorn/a
Meas. Tech.ChEMBL_982298 (CHEMBL2429516)
IC50 13000±n/a nM
Citation St John, SEJensen, KCKang, SChen, YCalamini, BMesecar, ADLipton, MA Design, synthesis, biological and structural evaluation of functionalized resveratrol analogues as inhibitors of quinone reductase 2. Bioorg Med Chem21:6022-37 (2013) 
 
Ribosyldihydronicotinamide dehydrogenase [quinone]
Name:Ribosyldihydronicotinamide dehydrogenase [quinone]
Type:Protein
Mol. Mass.:25917.25
Organism:Homo sapiens (Human)
Description:P16083
Residue:231
BDBM50440266
NameBDBM50440266
Synonyms:CHEMBL474126
TypeSmall organic molecule
Emp. Form.C18H21NO2
Mol. Mass.283.3648
SMILESCOc1ccc(\C=C\c2ccc(cc2)N(C)C)cc1OC