Reaction Details
TargetRibosyldihydronicotinamide dehydrogenase [quinone]
LigandBDBM50131688
Substrate/Competitorn/a
Meas. Tech.ChEMBL_982298 (CHEMBL2429516)
IC50 5100±n/a nM
Citation St John, SEJensen, KCKang, SChen, YCalamini, BMesecar, ADLipton, MA Design, synthesis, biological and structural evaluation of functionalized resveratrol analogues as inhibitors of quinone reductase 2. Bioorg Med Chem21:6022-37 (2013) 
 
Ribosyldihydronicotinamide dehydrogenase [quinone]
Name:Ribosyldihydronicotinamide dehydrogenase [quinone]
Type:Protein
Mol. Mass.:25917.25
Organism:Homo sapiens (Human)
Description:P16083
Residue:231
BDBM50131688
NameBDBM50131688
Synonyms:(E)-4-(3,5-dimethoxystyryl)phenol 4'-hydroxy-3,5-dimethoxy stilbene 4-[(E)-2-(3,5-Dimethoxy-phenyl)-vinyl]-phenol CHEMBL83527 Pterostilben | Pterostilbene
TypeSmall organic molecule
Emp. Form.C16H16O3
Mol. Mass.256.2964
SMILESCOc1cc(OC)cc(\C=C\c2ccc(O)cc2)c1