Reaction Details
TargetRibosyldihydronicotinamide dehydrogenase [quinone]
LigandBDBM50256049
Substrate/Competitorn/a
Meas. Tech.ChEMBL_982298 (CHEMBL2429516)
IC50 10900±n/a nM
Citation St John, SEJensen, KCKang, SChen, YCalamini, BMesecar, ADLipton, MA Design, synthesis, biological and structural evaluation of functionalized resveratrol analogues as inhibitors of quinone reductase 2. Bioorg Med Chem21:6022-37 (2013) 
 
Ribosyldihydronicotinamide dehydrogenase [quinone]
Name:Ribosyldihydronicotinamide dehydrogenase [quinone]
Type:Protein
Mol. Mass.:25917.25
Organism:Homo sapiens (Human)
Description:P16083
Residue:231
BDBM50256049
NameBDBM50256049
Synonyms:5-(1-(4-(dimethylamino)phenyl)but-1-en-2-yl)benzene-1,3-diol | CHEMBL470938
TypeSmall organic molecule
Emp. Form.C18H21NO2
Mol. Mass.283.3648
SMILESCC\C(=C/c1ccc(cc1)N(C)C)c1cc(O)cc(O)c1