Reaction Details
TargetTelomerase reverse transcriptase
LigandBDBM50310892
Substrate/Competitorn/a
Meas. Tech.ChEMBL_980998 (CHEMBL2427719)
IC50 18±n/a nM
Citation Artese, ACosta, GDistinto, SMoraca, FOrtuso, FParrotta, LAlcaro, S Toward the design of new DNA G-quadruplex ligands through rational analysis of polymorphism and binding data. Eur J Med Chem68:139-49 (2013) 
 
Telomerase reverse transcriptase
Name:Telomerase reverse transcriptase
Type:PROTEIN
Mol. Mass.:127099.03
Organism:Homo sapiens (Human)
Description:ChEMBL_1447029
Residue:1132
BDBM50310892
NameBDBM50310892
Synonyms:CHEMBL1078511 | N,N'-(9-(2-(1-methylpyrrolidin-2-yl)ethylamino)acridine-3,6-diyl)bis(3-(pyrrolidin-1-yl)propanamide)
TypeSmall organic molecule
Emp. Form.C34H47N7O2
Mol. Mass.585.7827
SMILESCN1CCCC1CCNc1c2ccc(NC(=O)CCN3CCCC3)cc2nc2cc(NC(=O)CCN3CCCC3)ccc12