Reaction Details
TargetRecQ-like DNA helicase BLM
LigandBDBM50440528
Substrate/Competitorn/a
Meas. Tech.ChEMBL_983202 (CHEMBL2428261)
IC50 910±n/a nM
Citation Rosenthal, ASDexheimer, TSGileadi, ONguyen, GHChu, WKHickson, IDJadhav, ASimeonov, AMaloney, DJ Synthesis and SAR studies of 5-(pyridin-4-yl)-1,3,4-thiadiazol-2-amine derivatives as potent inhibitors of Bloom helicase. Bioorg Med Chem Lett23:5660-6 (2013) 
 
RecQ-like DNA helicase BLM
Name:RecQ-like DNA helicase BLM
Type:PROTEIN
Mol. Mass.:159016.30
Organism:Homo sapiens (Human)
Description:ChEMBL_103670
Residue:1417
BDBM50440528
NameBDBM50440528
Synonyms:CHEMBL2426165
TypeSmall organic molecule
Emp. Form.C15H9BrN6OS
Mol. Mass.401.241
SMILESBrc1cc(NC(=O)Nc2nnc(s2)-c2ccncc2)ccc1C#N