Reaction Details
TargetBifunctional 3'-5' exonuclease/ATP-dependent helicase WRN
LigandBDBM50440527
Substrate/Competitorn/a
Meas. Tech.ChEMBL_983201 (CHEMBL2428260)
IC50 1100±n/a nM
Citation Rosenthal, ASDexheimer, TSGileadi, ONguyen, GHChu, WKHickson, IDJadhav, ASimeonov, AMaloney, DJ Synthesis and SAR studies of 5-(pyridin-4-yl)-1,3,4-thiadiazol-2-amine derivatives as potent inhibitors of Bloom helicase. Bioorg Med Chem Lett23:5660-6 (2013) 
 
Bifunctional 3'-5' exonuclease/ATP-dependent helicase WRN
Name:Bifunctional 3'-5' exonuclease/ATP-dependent helicase WRN
Type:PROTEIN
Mol. Mass.:162454.09
Organism:Homo sapiens (Human)
Description:ChEMBL_105140
Residue:1432
BDBM50440527
NameBDBM50440527
Synonyms:CHEMBL2426164
TypeSmall organic molecule
Emp. Form.C15H9BrN6OS
Mol. Mass.401.241
SMILESBrc1ccc(NC(=O)Nc2nnc(s2)-c2ccncc2)cc1C#N