Reaction Details
TargetHistamine H2 receptor
LigandBDBM50440990
Substrate/Competitorn/a
Meas. Tech.ChEMBL_985420 (CHEMBL2432449)
Ki 1733±n/a nM
Citation Banister, SDManoli, MBarron, MLWerry, ELKassiou, M N-substituted 8-aminopentacyclo[5.4.0.0(2,6).0(3,10).0(5,9)]undecanes ass receptor ligands with potential neuroprotective effects. Bioorg Med Chem21:6038-52 (2013) 
 
Histamine H2 receptor
Name:Histamine H2 receptor
Type:G Protein-Coupled Receptor (GPCR)
Mol. Mass.:40115.31
Organism:Homo sapiens (Human)
Description:n/a
Residue:359
BDBM50440990
NameBDBM50440990
Synonyms:CHEMBL2432051
TypeSmall organic molecule
Emp. Form.C21H27NO3
Mol. Mass.341.444
SMILESCOc1cc(CN[C@@H]2C3C4CC5C6CC(C3C46)C25)cc(OC)c1OC